{"text_format":"3","workbook":"xlsx","n_sheets":18,"sheets":["Cover","Contact","ConfigServer","DataMart","GIM","GKC","GVP ","ICON","iWD Sizing Calculator","LRM","Multimedia","OCS","WFM Oracle","WFM MSSQL","WFM DB2","ICON_IDBSize","IconRowSizes","UCS"],"not_rendered":{"images":1,"defined_names":56,"comments":2},"read":"whole","date_system":"1900"}

{"sheet":"Cover","index":0,"n_rows":13,"n_cols":1,"rows_kept":13,"merged":[[0,0,0,11],[12,0,12,11]]}
["Genesys Database Sizing Estimator 8.x Worksheets"]
[]
["Note: This Database Size Estimator provides a range of expected database sizes for various Genesys products. Click the tabs at the bottom to access a product. "]
[]
["The information contained herein is proprietary and confidential and cannot be disclosed or duplicated without the prior written consent of Genesys Telecommunications Laboratories, Inc. Copyright © 2000–2016 Genesys Telecommunications Laboratories, Inc. All rights reserved."]
[]
["About Genesys:  Genesys is the world's leading provider of customer service and contact center software—with more than 4,000 customers in 80 countries. Drawing on its more than 20 years of customer service innovation and experience, Genesys is uniquely positioned to help companies bring their people, insights and customer channels together to effectively drive today’s customer conversation. Genesys software directs more than 100 million interactions every day, maximizing the value of customer engagement and differentiating the experience by driving personalization and multi-channel customer service—and extending customer service across the enterprise to optimize processes and the performance of customer-facing employees. Go to www.genesyslab.com for more information. Each product has its own documentation for online viewing at the Genesys Customer Care website or on the Documentation Library DVD, which is available from Genesys upon request. For more information, contact your sales representative."]
["Notice: Although reasonable effort is made to ensure that the information in this document is complete and accurate at the time of release, Genesys  Telecommunications Laboratories, Inc., cannot assume responsibility for any existing errors. Changes and/or corrections to the information contained in this document may be incorporated in future versions.\nYour Responsibility for Your System’s Security: You are responsible for the security of your system. Product administration to prevent unauthorized use is your responsibility. Your system administrator should read all documents provided with this product to fully understand the features available that reduce your risk of incurring charges for unlicensed use of Genesys products."]
{"$rows_left_out":6}
{"sheet":"Contact","index":1,"n_rows":4,"n_cols":2,"rows_kept":4,"merged":[[2,1,2,3],[3,1,3,3]]}
[null,"Customer Care Contact Information"]
[]
[null,"Technical Support from VARs\nIf you have purchased support from a value-added reseller (VAR), please contact the VAR for technical support."]
[null,"Customer Care from Genesys\nIf you have purchased support directly from Genesys, please contact Genesys Customer Care (http://www.genesys.com/customer-care/contact-us). Before contacting\nCustomer Care, please refer to the Genesys Care Support Guide for On-Premises (http://www.genesys.com/customer-care/support-processes) for complete contact information and procedures."]

{"sheet":"ConfigServer","index":2,"n_rows":52,"n_cols":2,"rows_kept":52}
["Configuration Database 8.0"]
["Use this spreadsheet to estimate the size of the  Configuration Database for your environment. Some examples are provided.                           1.  Change the values for your environment.                                                                                                                                   2. Your estimated database size appears in the last row: Config DB Size (MB)"]
[]
["           Configuration Data Objects"]
[]
["Environment","Number"]
["Hosts",2]
["Alarm conditions",10]
{"$rows_left_out":45}
{"sheet":"DataMart","index":3,"n_rows":68,"n_cols":9,"rows_kept":68}
["                                        "," Select DB from drop-down","Record Length"]
["ODS and DataMart 8.0","Sybase",{"$f":"VLOOKUP(B2,H3:I6,2,FALSE)","v":83},{"$nulls":4},"Database","Record Length"]
["Use this spreadsheet to estimate the size of the ODS and DataMart Database for your environment. \nSome examples are provided.                                                                                                                                                                               1. Select the database from the drop-down menu in the second column.                                                                                          2. Change the values for your environment.                                                                                                                3. Your estimated database sizes appear in the last rows.   ",{"$nulls":6},"Oracle",42]
[{"$nulls":7},"MS SQLServer",66]
["           Layouts",{"$nulls":6},"IBM DB2",58]
[{"$nulls":7},"Sybase",83]
["Outbound Contact Layout Templates","Number","Statistics"]
["CALL_LS",1,24]
{"$rows_left_out":61}
{"sheet":"GIM","index":4,"n_rows":7,"n_cols":2,"rows_kept":7,"merged":[[3,1,3,4],[6,1,6,5]]}
["Genesys Info Mart Database Size Estimator"]
[]
["This Database Size Estimator requires a separate spreadsheet. Download the spreadsheet using the link provided below."]
[null,"GIM 8.1 Database Size Estimator"]
[]
["Note: The estimator can also be accessed from the Genesys Info Mart documentation landing page using the link provided below."]
[null,"https://docs.genesys.com/Documentation/GIM"]

{"sheet":"GKC","index":5,"n_rows":7,"n_cols":2,"rows_kept":7,"merged":[[3,1,3,4],[6,1,6,5]]}
["Genesys Knowledge Center Sizing Estimator"]
[]
["This Database Size Estimator requires a separate spreadsheet. Download the spreadsheet using the link provided below."]
[null,"Genesys Knowledge Center Sizing Workbook"]
[]
["Note: The estimator can also be accessed from the Genesys Knowleddge Center documentation landing page using the link provided below."]
[null,"https://docs.genesys.com/Documentation/KC"]

{"sheet":"GVP ","index":6,"n_rows":53,"n_cols":14,"rows_kept":53,"merged":[[1,0,1,1],[1,2,1,3],[2,2,2,3],[2,6,8,6],[2,12,8,12],[2,13,46,13],[3,2,3,3],[3,7,8,7],[3,11,8,11],[4,2,4,3],[5,2,5,3],[6,2,6,3],[7,2,7,3],[8,2,8,3],[9,2,9,3],[9,6,32,6],[9,12,32,12],[10,2,10,3],[10,7,15,7],[10,11,15,11],[11,2,11,3],[12,2,12,3],[13,2,13,3],[14,2,14,3],[15,2,15,3],[16,2,16,3],[17,2,17,3],[17,7,23,7],[18,2,18,3],[18,11,23,11],[19,2,19,3],[20,2,20,3],[21,2,21,3],[22,2,22,3],[23,2,23,3],[24,2,24,3],[24,7,27,7],[24,11,27,11],[28,7,32,7],[28,11,32,11],[30,0,35,0],[33,6,40,6],[33,12,40,12],[34,7,39,7],[34,11,39,11],[36,0,41,0],[41,6,46,6],[41,7,46,7],[41,11,46,11],[41,12,46,12],[43,0,46,0],[47,0,51,0]]}
["GVP"]
["Required Estimates",null,"Description",{"$nulls":3},"Component",null,"Data Type","Percent of Total","Required Disk Usage (MB)","Sum per Datatype per Component (GB)","Sum per Component (GB)","Sum (GB) + Overhead"]
["# of DN",30,{"$nulls":4},"Resource Manager","CDR","CDR",{"$f":"(K3/1024)/$N$3","v":{"v":0.3377601148078255,"d":"33.776%"}},{"$f":"((1300 + 1430*B13)*B12 *(C30+1)) / 1048576","v":{"v":1882790.2221679687,"d":"1,882,790.222168"}},{"$f":" K3 / 1024","v":{"v":1838.662326335907,"d":"1,838.662326"}},{"$f":" L3 + L4","v":{"v":1839.1742876172066,"d":"1,839.174288"}},{"$f":"M3+M10+M34+M42 + 0.5","v":{"v":5443.692862853407,"d":"5,443.692863"}}]
["# of IVR Profiles",30,{"$nulls":5},"Operational Reporting","OR (5 minutes)",{"$f":"(K4/1024)/$N$3","v":{"v":7.44990603380922e-05,"d":"0.007%"}},{"$f":" 300 *(B3  + B4 + B5 + B9 + B10 + 1) * B6 * 2 * 1440 * (C31+1) / 1048576","v":{"v":415.283203125,"d":"415.283203"}},{"$f":" (K4 + K5 + K6 + K7 + K8+ K9) / 1024","v":{"v":0.5119612812995911,"d":"0.511961"}}]
["# of Tenants",2,"Include number of Sub-Tenants",{"$nulls":5},"OR (30 minutes)",{"v":9.93320804507896e-06,"d":"0.001%"},{"$f":" 300 * (B3 + B4 + B5 + B9 + B10 + 1) * B6 * 2* 48 *(C32+1) / 1048576","v":{"v":55.37109375,"d":"55.371094"}}]
["# of RM",4,"Number of ALL ResourceManager applications. HA-pairs count as 2",{"$nulls":5},"OR (hourly)",{"v":4.96660402253948e-06,"d":"0.000%"},{"$f":" 300 * (B3 + B4 + B5 + B9 + B10 + 1)* B6 * 2 * 24 * (C33+1) / 1048576","v":{"v":27.685546875,"d":"27.685547"}}]
["# of MCPs",8,"Number of Media Control Platform Applications",{"$nulls":5},"OR (daily)",{"v":2.353963364849441E-6,"d":"0.000%"},{"$f":" 300 * (B3 + B4 + B5 + B9 + B10 +1) *B6 *2 * (C34+1) / 1048576","v":{"v":13.121795654296875,"d":"13.121796"}}]
["# of CCPs",0,"Number of Call Control Platform Applications",{"$nulls":5},"OR (weekly)",{"v":1.3488173126688318E-6,"d":"0.000%"},{"$f":" 300 * (B3 + B4 + B5 + B9 + B10 + 1) *B6 * 2 *(C35+1) / (7 * 1048576)","v":{"v":7.518768310546875,"d":"7.518768"}}]
{"$rows_left_out":46}
{"sheet":"ICON","index":7,"n_rows":7,"n_cols":2,"rows_kept":7,"merged":[[3,1,3,4],[6,1,6,5]]}
["Interaction Concentrator Database Size Estimator"]
[]
["This Database Size Estimator requires a separate spreadsheet. Download the spreadsheet using the link provided below."]
[null,"ICON 8.1 Database Size Estimator"]
[]
["Note: The estimator can also be accessed from the Interaction Concentrator documentation landing page using the link provided below."]
[null,"https://docs.genesys.com/Documentation/ICON"]

{"sheet":"iWD Sizing Calculator","index":8,"n_rows":51,"n_cols":6,"rows_kept":51,"merged":[[12,1,12,2],[15,4,15,5],[21,3,21,4]]}
["iWD 8.0 with MS SQL Server"]
[]
["System Profile","Number",null,"H/W Configuration","Number"]
["Task expiration period (days)",30,{"$f":"IF(B4 < 1,\"< 1 ERROR\", \"\")","v":""},"CPU clock (GHz)",{"v":2.8,"d":"3"}]
["iWD Data Mart DB retention period (days)",365,{"$f":"IF(B5 < 1,\"< 1 ERROR\", \"\")","v":""},"CPU core number",4]
["Incoming task rate (per day)",{"v":200000,"d":"200,000"},{"$f":"IF(B6 < B8,TEXT(B8,\"<  0.00\"), \"\")","v":""},"Memory (MB)",{"v":4000,"d":"4,000"}]
["Average re-prioritization period (hours)",{"v":0.7,"d":"1"},{"$f":"IF(B7 < 0.1,\"<  0.1 ERROR\", \"\")","v":""}]
["Maximum incoming task rate (per second)",30,{"$f":"IF(B8 < B6/24/3600,TEXT(B6/24/3600,\"<  0.00\"), \"\")","v":""}]
{"$rows_left_out":44}
{"sheet":"LRM","index":9,"n_rows":20,"n_cols":3,"rows_kept":20,"merged":[[18,0,18,2],[19,0,19,2]]}
[]
["License Reporting Manager:   LRM Sizing Recommendations "]
[]
["LRM does not require complex sizing calculations.  The table below from the Hardware Sizing Guide is included here for spreadsheet user convenience.  "]
[]
[null,"Medium Contact Centre","Large Contact Centre"]
["Total agents",1000,{"v":21000,"d":"21,000"}]
["Total shifts",2,3]
{"$rows_left_out":13}
{"sheet":"Multimedia","index":10,"n_rows":14,"n_cols":3,"rows_kept":14}
["Multimedia 8.0"," "]
["Use this spreadsheet to estimate the size of the  Multimedia Database for your environment. Some examples are provided.                                    1.  Change the values in the number column for your environment.                                                                                                   2. Your estimated database sizes appear in the last rows."]
[]
[]
["Entry","Number"]
["Email Interactions Per Day",100]
["Chat Interactions Per Day",{"v":1000,"d":"1,000"}]
["Attached Data, in Kbytes",16," Recommended limit - 16 Kb"]
{"$rows_left_out":7}
{"sheet":"OCS","index":11,"n_rows":36,"n_cols":4,"rows_kept":36,"merged":[[5,0,5,1]]}
["Outbound Contact 8.0"]
["Use this spreadsheet to estimate the size of the Outbound Contact Database for your environment. Some examples are provided.                                                                1.  Change the values for your environment.                                                                                                                                   2. Your estimated database sizes appear in the last rows.\nNote:  This spread sheet supports up to 8 calling lists.  For more than 8 calling lists, use the following formula for estimated database sizing.",null,null," "]
[]
["Formula: "]
[]
["M  - number of calling lists,\nNi – number of records in the calling list i,\nLi – length of record for calling list i.\nsi – coefficient for index space.\nExample:  OCS uses two calling lists: List 1 contains 100000 records with record size 600 bytes and List 2 contains 50000 records with record size 450 bytes. Indexes occupy one-third of table space. Estimated database size will be: \n1.33 * (100000*600 + 50000*450) / (1024*1024) = 104.6 MB\n"]
[]
["Entry","Number"]
{"$rows_left_out":29}
{"sheet":"WFM Oracle","index":12,"n_rows":58,"n_cols":5,"rows_kept":58}
["Workforce Management 8.0 with Oracle"]
[]
["Contact Center Configuration","Number"]
["Type of the Database Server:","Oracle"]
["Number of Sites:",3,"<--","Please enter the estimated number of Sites","nSites"]
["Number of Activities and Multi-Site Activities:",100,"<--","Please enter the estimated number of Activities","nActivities"]
["Number of Agents:",{"v":3000,"d":"3,000"},"<--","Please enter the estimated number of Agents","nAgents"]
["Number of Teams:",300,"<--","Please enter the estimated number of Teams","nTeams"]
{"$rows_left_out":51}
{"sheet":"WFM MSSQL","index":13,"n_rows":58,"n_cols":5,"rows_kept":58}
["Workforce Management 8.0 with Microsoft SQL Server"]
[]
["Contact Center Configuration","Number"]
["Type of the Database Server:","MSSQL"]
["Number of Sites:",3,"<--","Please enter the estimated number of Sites","nSites"]
["Number of Activities and Multi-Site Activities:",100,"<--","Please enter the estimated number of Activities","nActivities"]
["Number of Agents:",{"v":3000,"d":"3,000"},"<--","Please enter the estimated number of Agents","nAgents"]
["Number of Teams:",300,"<--","Please enter the estimated number of Teams","nTeams"]
{"$rows_left_out":51}
{"sheet":"WFM DB2","index":14,"n_rows":58,"n_cols":5,"rows_kept":58}
["Workforce Management 8.0 with DB2"]
[]
["Contact Center Configuration","Number"]
["Type of the Database Server:","DB2"]
["Number of Sites:",3,"<--","Please enter the estimated number of Sites","nSites"]
["Number of Activities and Multi-Site Activities:",100,"<--","Please enter the estimated number of Activities","nActivities"]
["Number of Agents:",{"v":3000,"d":"3,000"},"<--","Please enter the estimated number of Agents","nAgents"]
["Number of Teams:",300,"<--","Please enter the estimated number of Teams","nTeams"]
{"$rows_left_out":51}
{"sheet":"ICON_IDBSize","index":15,"n_rows":51,"n_cols":9,"rows_kept":51,"hidden":true}
["Table","Row Size","Rows Per Day","Table Size Per Year","Index Size Per Year","Total Size Per Year","Rows Per Year","Comments"]
["GS_AGENT_STAT",{"$f":"IconRowSizes!M48","v":{"$error":"#REF!"}},{"$f":"IF(VLOOKUP(#REF!,#REF!,2,FALSE), C19*#REF!, 0)","v":{"$error":"#REF!"}},{"$f":"$B$50*CEILING($G2/FLOOR($B$48/$B2,1),1)","v":{"$error":"#REF!"}},{"$f":"$B$50*IF(IconRowSizes!$N48, CEILING($G2/FLOOR($B$49/IconRowSizes!$N48,1),1),0) + IF(IconRowSizes!$O48, $B$50*CEILING($G2/FLOOR($B$49/IconRowSizes!$O48,1),1),0) + IF(IconRowSizes!$P48, $B$50*CEILING($G2/FLOOR($B$49/IconRowSizes!$P48,1),1),0) + IF(IconRowSizes!$Q48, $B$50*CEILING($G2/FLOOR($B$49/IconRowSizes!$Q48,1),1),0) + IF(IconRowSizes!$R48, $B$50*CEILING($G2/FLOOR($B$49/IconRowSizes!$R48,1),1),0) + IF(IconRowSizes!$S48, $B$50*CEILING($G2/FLOOR($B$49/IconRowSizes!$S48,1),1),0)","v":{"$error":"#REF!"}},{"$f":"SUM(D2:E2)","v":{"$error":"#REF!"}},{"$f":"$C2*#REF!","v":{"$error":"#REF!"}},null," "]
["GS_AGENT_STAT_WM",{"$f":"IconRowSizes!M49","v":{"$error":"#REF!"}},{"$f":"IF(VLOOKUP(#REF!,#REF!,2,FALSE), 5*C4, 0)","v":{"$error":"#REF!"}},{"$error":"#REF!"},{"$f":"$B$50*IF(IconRowSizes!$N49, CEILING($G3/FLOOR($B$49/IconRowSizes!$N49,1),1),0) + IF(IconRowSizes!$O49, $B$50*CEILING($G3/FLOOR($B$49/IconRowSizes!$O49,1),1),0) + IF(IconRowSizes!$P49, $B$50*CEILING($G3/FLOOR($B$49/IconRowSizes!$P49,1),1),0) + IF(IconRowSizes!$Q49, $B$50*CEILING($G3/FLOOR($B$49/IconRowSizes!$Q49,1),1),0) + IF(IconRowSizes!$R49, $B$50*CEILING($G3/FLOOR($B$49/IconRowSizes!$R49,1),1),0) + IF(IconRowSizes!$S49, $B$50*CEILING($G3/FLOOR($B$49/IconRowSizes!$S49,1),1),0)","v":{"$error":"#REF!"}},{"$f":"SUM(D3:E3)","v":{"$error":"#REF!"}},{"$f":"$C3*#REF!","v":{"$error":"#REF!"}}]
["GX_SESSION_ENDPOINT",{"$f":"IconRowSizes!M50","v":{"$error":"#REF!"}},{"$f":"IF(VLOOKUP(#REF!,#REF!,2,FALSE),C19*#REF!+#REF!,0)","v":{"$error":"#REF!"}},{"$error":"#REF!"},{"$f":"$B$50*IF(IconRowSizes!$N50, CEILING($G4/FLOOR($B$49/IconRowSizes!$N50,1),1),0) + IF(IconRowSizes!$O50, $B$50*CEILING($G4/FLOOR($B$49/IconRowSizes!$O50,1),1),0) + IF(IconRowSizes!$P50, $B$50*CEILING($G4/FLOOR($B$49/IconRowSizes!$P50,1),1),0) + IF(IconRowSizes!$Q50, $B$50*CEILING($G4/FLOOR($B$49/IconRowSizes!$Q50,1),1),0) + IF(IconRowSizes!$R50, $B$50*CEILING($G4/FLOOR($B$49/IconRowSizes!$R50,1),1),0) + IF(IconRowSizes!$S50, $B$50*CEILING($G4/FLOOR($B$49/IconRowSizes!$S50,1),1),0)","v":{"$error":"#REF!"}},{"$error":"#REF!"},{"$f":"$C4*#REF!","v":{"$error":"#REF!"}}]
["G_AGENT_STATE_HISTORY",{"$f":"IconRowSizes!M51","v":{"$error":"#REF!"}},{"$f":"IF(VLOOKUP(#REF!,#REF!,2,FALSE),C4*(2*#REF! + 2 +#REF! *#REF!) + C19*#REF!,0)","v":{"$error":"#REF!"}},{"$error":"#REF!"},{"$f":"$B$50*IF(IconRowSizes!$N51, CEILING($G5/FLOOR($B$49/IconRowSizes!$N51,1),1),0) + IF(IconRowSizes!$O51, $B$50*CEILING($G5/FLOOR($B$49/IconRowSizes!$O51,1),1),0) + IF(IconRowSizes!$P51, $B$50*CEILING($G5/FLOOR($B$49/IconRowSizes!$P51,1),1),0) + IF(IconRowSizes!$Q51, $B$50*CEILING($G5/FLOOR($B$49/IconRowSizes!$Q51,1),1),0) + IF(IconRowSizes!$R51, $B$50*CEILING($G5/FLOOR($B$49/IconRowSizes!$R51,1),1),0) + IF(IconRowSizes!$S51, $B$50*CEILING($G5/FLOOR($B$49/IconRowSizes!$S51,1),1),0)","v":{"$error":"#REF!"}},{"$error":"#REF!"},{"$f":"$C5*#REF!","v":{"$error":"#REF!"}}]
["G_AGENT_STATE_RC",{"$f":"IconRowSizes!M52","v":{"$error":"#REF!"}},{"$f":"IF(VLOOKUP(#REF!,#REF!,2,FALSE),ROUND(C5/C4,0),0)","v":{"$error":"#REF!"}},{"$error":"#REF!"},{"$f":"$B$50*IF(IconRowSizes!$N52, CEILING($G6/FLOOR($B$49/IconRowSizes!$N52,1),1),0) + IF(IconRowSizes!$O52, $B$50*CEILING($G6/FLOOR($B$49/IconRowSizes!$O52,1),1),0) + IF(IconRowSizes!$P52, $B$50*CEILING($G6/FLOOR($B$49/IconRowSizes!$P52,1),1),0) + IF(IconRowSizes!$Q52, $B$50*CEILING($G6/FLOOR($B$49/IconRowSizes!$Q52,1),1),0) + IF(IconRowSizes!$R52, $B$50*CEILING($G6/FLOOR($B$49/IconRowSizes!$R52,1),1),0) + IF(IconRowSizes!$S52, $B$50*CEILING($G6/FLOOR($B$49/IconRowSizes!$S52,1),1),0)","v":{"$error":"#REF!"}},{"$error":"#REF!"},{"$f":"$C6*#REF!","v":{"$error":"#REF!"}}]
["G_CALL",{"$f":"IconRowSizes!M53","v":{"$error":"#REF!"}},{"$f":"IF(VLOOKUP(#REF!,#REF!,2,FALSE),C15,0)","v":{"$error":"#REF!"}},{"$error":"#REF!"},{"$f":"$B$50*IF(IconRowSizes!$N53, CEILING($G7/FLOOR($B$49/IconRowSizes!$N53,1),1),0) + IF(IconRowSizes!$O53, $B$50*CEILING($G7/FLOOR($B$49/IconRowSizes!$O53,1),1),0) + IF(IconRowSizes!$P53, $B$50*CEILING($G7/FLOOR($B$49/IconRowSizes!$P53,1),1),0) + IF(IconRowSizes!$Q53, $B$50*CEILING($G7/FLOOR($B$49/IconRowSizes!$Q53,1),1),0) + IF(IconRowSizes!$R53, $B$50*CEILING($G7/FLOOR($B$49/IconRowSizes!$R53,1),1),0) + IF(IconRowSizes!$S53, $B$50*CEILING($G7/FLOOR($B$49/IconRowSizes!$S53,1),1),0)","v":{"$error":"#REF!"}},{"$error":"#REF!"},{"$f":"$C7*#REF!","v":{"$error":"#REF!"}}]
["G_CALL_HISTORY",{"$f":"IconRowSizes!M54","v":{"$error":"#REF!"}},{"$f":"IF(VLOOKUP(#REF!,#REF!,2,FALSE),2*C7,0)","v":{"$error":"#REF!"}},{"$error":"#REF!"},{"$f":"$B$50*IF(IconRowSizes!$N54, CEILING($G8/FLOOR($B$49/IconRowSizes!$N54,1),1),0) + IF(IconRowSizes!$O54, $B$50*CEILING($G8/FLOOR($B$49/IconRowSizes!$O54,1),1),0) + IF(IconRowSizes!$P54, $B$50*CEILING($G8/FLOOR($B$49/IconRowSizes!$P54,1),1),0) + IF(IconRowSizes!$Q54, $B$50*CEILING($G8/FLOOR($B$49/IconRowSizes!$Q54,1),1),0) + IF(IconRowSizes!$R54, $B$50*CEILING($G8/FLOOR($B$49/IconRowSizes!$R54,1),1),0) + IF(IconRowSizes!$S54, $B$50*CEILING($G8/FLOOR($B$49/IconRowSizes!$S54,1),1),0)","v":{"$error":"#REF!"}},{"$error":"#REF!"},{"$f":"$C8*#REF!","v":{"$error":"#REF!"}}]
{"$rows_left_out":44}
{"sheet":"IconRowSizes","index":16,"n_rows":84,"n_cols":21,"rows_kept":84,"hidden":true}
["Data Type","bigint","int","smallint","number (16)","number (19)","number (20)","datetime","varchar(50)","varchar(64)","varchar(128)","varchar(255)","Block Header","Row Header","Index Block Header","Index Row Header","Block Free Size","Index Block Free Size"]
["Bytes (Current)",{"$f":"CHOOSE(VLOOKUP(#REF!,#REF!,2,FALSE),B3,B4,B5)","v":{"$error":"#REF!"}},{"$f":"CHOOSE(VLOOKUP(#REF!,#REF!,2,FALSE),C3,C4,C5)","v":{"$error":"#REF!"}},{"$f":"CHOOSE(VLOOKUP(#REF!,#REF!,2,FALSE),D3,D4,D5)","v":{"$error":"#REF!"}},{"$f":"CHOOSE(VLOOKUP(#REF!,#REF!,2,FALSE),E3,E4,E5)","v":{"$error":"#REF!"}},{"$f":"CHOOSE(VLOOKUP(#REF!,#REF!,2,FALSE),F3,F4,F5)","v":{"$error":"#REF!"}},{"$f":"CHOOSE(VLOOKUP(#REF!,#REF!,2,FALSE),G3,G4,G5)","v":{"$error":"#REF!"}},{"$f":"CHOOSE(VLOOKUP(#REF!,#REF!,2,FALSE),H3,H4,H5)","v":{"$error":"#REF!"}},{"$f":"CHOOSE(VLOOKUP(#REF!,#REF!,2,FALSE),I3,I4,I5)","v":{"$error":"#REF!"}},{"$f":"CHOOSE(VLOOKUP(#REF!,#REF!,2,FALSE),J3,J4,J5)","v":{"$error":"#REF!"}},{"$f":"CHOOSE(VLOOKUP(#REF!,#REF!,2,FALSE),K3,K4,K5)","v":{"$error":"#REF!"}},{"$f":"CHOOSE(VLOOKUP(#REF!,#REF!,2,FALSE),L3,L4,L5)","v":{"$error":"#REF!"}},{"$f":"CHOOSE(VLOOKUP(#REF!,#REF!,2,FALSE),M3,M4,M5)","v":{"$error":"#REF!"}},{"$f":"CHOOSE(VLOOKUP(#REF!,#REF!,2,FALSE),N3,N4,N5)","v":{"$error":"#REF!"}},{"$f":"CHOOSE(VLOOKUP(#REF!,#REF!,2,FALSE),O3,O4,O5)","v":{"$error":"#REF!"}},{"$f":"CHOOSE(VLOOKUP(#REF!,#REF!,2,FALSE),P3,P4,P5)","v":{"$error":"#REF!"}},{"$f":"FLOOR((#REF! - M2)*(1-#REF!),1)","v":{"$error":"#REF!"}},{"$f":"FLOOR((#REF! - O2)*(1-#REF!),1)","v":{"$error":"#REF!"}}]
["Bytes (Oracle)",11,6,4,9,11,11,11,53,65,129,258,84,3,161,8,{"$nulls":4},"Header estimates for Oracle could be outdated (taken from several sources, including Oracle 7 documentation). Hopefully, progress should save memory, don't waste it."]
["Bytes (MSSQL)",8,4,2,9,9,13,8,52,66,130,257,0,15,0,16]
["Bytes (DB2)",8,4,2,9,10,11,10,52,66,130,258,84,3,161,8,{"$nulls":4},"For DB2 header estimates were just forcibly set to those of Oracle"]
[]
["Table","smallint","integer","bigint","number(16)","number(19)","number(20)","datetime","varchar(50)","varchar(64)","varchar(128)","varchar(255)","Row Size","IES 1","IES 2","IES 3","IES 4","IES 5","IES 6","IES 7"]
["GCX_AGENT_PLACE",0,13,2,1,0,0,3,0,0,0,0,{"$f":"13+B2*B8 + C2*C8 + D2*D8 + E2*E8 + F2*F8 + G2*G8 + H2*H8 + I2*I8 + J2*J8 + K2*K8 + L2*L8","v":{"$error":"#REF!"}},{"$f":"P2+E2","v":{"$error":"#REF!"}},{"$f":"P2+C2+C2","v":{"$error":"#REF!"}},0,0,0,0]
{"$rows_left_out":77}
{"sheet":"UCS","index":17,"n_rows":57,"n_cols":2,"rows_kept":57}
["Universal Contact Server / Context Services 8.1"," "]
["Use this spreadsheet to estimate the size of the  Universal Contact Server database for your environment. Some examples are provided. Scroll over red marks for information.                                            1.  Change the values in the Number column to match your environment.                                                                                                   2. Estimated database sizes appear in the last rows."]
["Profile entries","Number"]
["Number of Profiles",{"v":500000,"d":"500,000"}]
["Number of defined Core Attributes",4]
["Number of defined Extensions",5]
["Number of fixed attributes in Extensions",5]
["Number of string attributes in Extensions",15]
{"$rows_left_out":49}